Benzene, 1,2-dimethyl-4-(1-methylpropyl)

Normal alkane RI, non-polar column, custom temperature program

Data compiled by: NIST Mass Spectrometry Data Center, William E. Wallace, director

Column type Capillary
Active phase SE-30
Column length (m)
Carrier gas
Substrate
Column diameter (mm)
Phase thickness (μm)
Program not specified
I 1209.
ReferenceXiuhua, Zhang, et al., 1996
Comment MSDC-RI

References

Xiuhua, Zhang, et al., 1996
Xiuhua, Zh.; Zhang, L.; Che, X., Prediction of the Kovats retention indexes of polysubstituted alkylbenzenes, Chin. J. Chromatogr., 1996, 14, 4, 244-248. [all data]