3,7,11,15-Tetramethyl-2-hexadecenal, O-methyloxime

Normal alkane RI, non-polar column, isothermal

Data compiled by: NIST Mass Spectrometry Data Center, William E. Wallace, director

Column type Packed
Active phase OV-101
Column length (m) 2.5
Carrier gas Helium
Substrate Gas-Chrom Q (800-120 mesh)
Column diameter (mm)
Phase thickness (μm)
Temperature (C) 220.
I 2197.
ReferencePhillipou and Poulos, 1978
Comment MSDC-RI

References

Phillipou and Poulos, 1978
Phillipou, G.; Poulos, A., GAs chromatography-mass spectrometry of fatty aldehydes and their oxime derivatives, Chemistry and Physics of Lipids, 1978, 22, 1, 51-54, https://doi.org/10.1016/0009-3084(78)90006-3 . [all data]