Benzene, 1,4-dimethyl-2-(1-methylpropyl)

Kovats' RI, non-polar column, isothermal

Data compiled by: NIST Mass Spectrometry Data Center, William E. Wallace, director

Column type CapillaryCapillaryCapillary
Active phase HP-1HP-1OV-101
Column length (m) 25.25.50.
Carrier gas N2N2He
Substrate
Column diameter (mm) 0.200.200.20
Phase thickness (μm)
Temperature (C) 100.100.100.
I 1190.1191.1191.
ReferenceZhang, Li, et al., 1992Zhang, Li, et al., 1992Matisová, Kovacicová, et al., 1989
Comment MSDC-RI MSDC-RI MSDC-RI

Normal alkane RI, polar column, isothermal

Data compiled by: NIST Mass Spectrometry Data Center, William E. Wallace, director

Column type CapillaryCapillaryCapillaryCapillaryCapillary
Active phase PEG-40MPEG-40MPEG-40MPEG-40MPEG-40M
Column length (m) 50.50.50.50.50.
Carrier gas
Substrate
Column diameter (mm)
Phase thickness (μm)
Temperature (C) 100.100.120.140.160.
I 1440.1440.1452.1464.1477.
ReferenceNesterov, Nesterova, et al., 2000Nesterov, Nesterova, et al., 2000Nesterov, Nesterova, et al., 2000Nesterov, Nesterova, et al., 2000Nesterov, Nesterova, et al., 2000
Comment MSDC-RI MSDC-RI MSDC-RI MSDC-RI MSDC-RI
Column type CapillaryCapillary
Active phase PEG-40MCarbowax 20M
Column length (m) 50.
Carrier gas
Substrate
Column diameter (mm)
Phase thickness (μm)
Temperature (C) 80.90.
I 1429.1402.
ReferenceNesterov, Nesterova, et al., 2000Sutter, Peterson, et al., 1997
Comment MSDC-RI MSDC-RI

References

Zhang, Li, et al., 1992
Zhang, M.J.; Li, S.D.; Chen, B.J., Compositional studies of high-temperature coal tar by GC/FTIR analysis of light oil fractions, Chromatographia, 1992, 33, 3/4, 138-146, https://doi.org/10.1007/BF02275894 . [all data]

Matisová, Kovacicová, et al., 1989
Matisová, E.; Kovacicová, E.; Ha, P.T.; Kolek, E.; Engewald, W., Identification of alkylbenzenes up to C12 by capillary gas chromatography-mass spectrometry. II. Retention indices on OV-101 columns and retention-molecular structure correlations, J. Chromatogr., 1989, 475, 2, 113-123, https://doi.org/10.1016/S0021-9673(01)89667-9 . [all data]