Benzene, 1-methyl-3-pentyl

Kovats' RI, non-polar column, isothermal

Data compiled by: NIST Mass Spectrometry Data Center, William E. Wallace, director

Column type Capillary
Active phase OV-101
Column length (m) 50.
Carrier gas He
Substrate
Column diameter (mm) 0.20
Phase thickness (μm)
Temperature (C) 100.
I 1235.
ReferenceMatisová, Kovacicová, et al., 1989
Comment MSDC-RI

Normal alkane RI, non-polar column, isothermal

Data compiled by: NIST Mass Spectrometry Data Center, William E. Wallace, director

Column type Capillary
Active phase OV-1
Column length (m) 40.
Carrier gas He
Substrate
Column diameter (mm) 0.50
Phase thickness (μm)
Temperature (C) 120.
I 1246.
ReferenceProtic, Svob, et al., 1980
Comment MSDC-RI

Normal alkane RI, polar column, custom temperature program

Data compiled by: NIST Mass Spectrometry Data Center, William E. Wallace, director

Column type Capillary
Active phase Carbowax 20M
Column length (m)
Carrier gas
Substrate
Column diameter (mm)
Phase thickness (μm)
Program not specified
I 1465.
ReferenceIvanciuc, Ivanciuc, et al., 2001
Comment MSDC-RI

References

Matisová, Kovacicová, et al., 1989
Matisová, E.; Kovacicová, E.; Ha, P.T.; Kolek, E.; Engewald, W., Identification of alkylbenzenes up to C12 by capillary gas chromatography-mass spectrometry. II. Retention indices on OV-101 columns and retention-molecular structure correlations, J. Chromatogr., 1989, 475, 2, 113-123, https://doi.org/10.1016/S0021-9673(01)89667-9 . [all data]