Sorbitol, 2-methyl, acetylated

Normal alkane RI, non-polar column, temperature ramp

View large format table.

Column type Active phase I Reference Comment
PackedOV-52075.Kajiyama and Hayashi, 19784. K/min; Column length: 4. m; Tstart: 100. C
PackedOV-52072.Kajiyama and Hayashi, 19786. K/min; Column length: 4. m; Tstart: 100. C

References

Kajiyama and Hayashi, 1978
Kajiyama, K.; Hayashi, Y., Gas chromatographic retention behaviour of trifluoroacetyl, acetyl and trimethylsilyl derivatives of various O-methylsorbitols, Sen-I Gakkaishi, 1978, 34, 8, t366-t375, https://doi.org/10.2115/fiber.34.8_T366 . [all data]