5α-Pregnane-11,20-dione-3α,21-diol, MO-TMS, # 1

Normal alkane RI, non-polar column, temperature ramp

View large format table.

Column type Active phase I Reference Comment
CapillarySE-523040.Honour, Tourniaire, et al., 1978Helium, 2. K/min; Column length: 19. m; Column diameter: 0.40 mm; Tstart: 160. C; Tend: 260. C

References

Honour, Tourniaire, et al., 1978
Honour, J.W.; Tourniaire, J.; Biglieri, E.G.; Shackleton, C.H.L., Urinary steroid excretion in 17alpha-hydroxylase deficiency, J. Steroid Biochem., 1978, 9, 6, 495-505, https://doi.org/10.1016/0022-4731(78)90115-2 . [all data]