Thromboxane B2, 9,12-methaneboronate-TMS

Normal alkane RI, non-polar column, isothermal

View large format table.

Column type Active phase Temperature (C) I Reference Comment
PackedOV-1245.2670.Smith, Harland, et al., 1977Nitrogen, Gas-Chrom Q (100-120 mesh); Column length: 3. m

References

Smith, Harland, et al., 1977
Smith, A.G.; Harland, W.A.; Brooks, C.J.W., Gas-liquid chromatography-mass spectrometry of thromboxane B2 and its detection in semen and human aorta by selected ion monitoring, J. Chromatogr., 1977, 142, 533-547, https://doi.org/10.1016/S0021-9673(01)92066-7 . [all data]