Benzene, 1-methyl-4-(1,1-dimethylpropyl)

Normal alkane RI, non-polar column, isothermal

View large format table.

Column type Active phase Temperature (C) I Reference Comment
CapillarySqualane130.1192.Papazova and Pankova, 1975N2; Column length: 100. m; Column diameter: 0.25 mm

Normal alkane RI, polar column, isothermal

View large format table.

Column type Active phase Temperature (C) I Reference Comment
CapillaryPEG-40M100.1411.Nesterov, Nesterova, et al., 2000Column length: 50. m
CapillaryPEG-40M100.1414.Nesterov, Nesterova, et al., 2000Column length: 50. m
CapillaryPEG-40M120.1428.Nesterov, Nesterova, et al., 2000Column length: 50. m
CapillaryPEG-40M140.1442.Nesterov, Nesterova, et al., 2000Column length: 50. m
CapillaryPEG-40M160.1453.Nesterov, Nesterova, et al., 2000Column length: 50. m
CapillaryPEG-40M80.1401.Nesterov, Nesterova, et al., 2000Column length: 50. m

References

Papazova and Pankova, 1975
Papazova, D.I.; Pankova, M.C., Identification of individual aromatic hydrocarbons in kerosene fraction (b.p. 150-250 °), J. Chromatogr., 1975, 105, 2, 411-414, https://doi.org/10.1016/S0021-9673(01)82276-7 . [all data]

Nesterov, Nesterova, et al., 2000
Nesterov, I.A.; Nesterova, T.N.; Pimerzin, A.A.; Tsvetkov, V.S., Thermodynamics of alkylbenzene sorption and evaporation. IV. Enthalpies of evaporation and thermodynamics chracteristics of sorption by stationary phases OV-101 and PEG-40M, Izvestia vysshikh uchebnykh zavedenii. Khimia i khimicheskaia tekhnologia (Chemistry and chemical technology), 2000, 43, 4, 39-45. [all data]