N4-Acetyl sulfameter

Normal alkane RI, non-polar column, temperature ramp

View large format table.

Column type Active phase I Reference Comment
PackedOV-1013090.Roder and Stuthe, 1974N2, Gas-Chrom Q (80-100 mesh), 12. K/min; Column length: 1.2 m; Tstart: 210. C; Tend: 275. C

References

Roder and Stuthe, 1974
Roder, E.; Stuthe, W., Gas-chromatographisce Bestimmung von Sulfonamiden und ihren N4-Acetyl-Metaboliten aus Blut and Harn, Z. Anal. Chem., 1974, 271, 4, 281-283, https://doi.org/10.1007/BF00432831 . [all data]