Isoleucine, MTH-TMS

Normal alkane RI, non-polar column, isothermal

View large format table.

Column type Active phase Temperature (C) I Reference Comment
PackedSE-30140.1649.Lamkin, Weatherford, et al., 1974Nitrogen, Supelcoport (80-100 mesh); Column length: 1.75 m

References

Lamkin, Weatherford, et al., 1974
Lamkin, W.M.; Weatherford, J.W.; Jones, N.S.; Pan, T.; Ward, D.N., Analysis of methylthiohydantoines of amino acids by gas-liquid chromatography of their trimethylsilyl derivatives, Anal. Biochem., 1974, 58, 2, 422-438, https://doi.org/10.1016/0003-2697(74)90211-5 . [all data]