1,2-bis-(2-Naphthyl)ethylene, cis

Normal alkane RI, non-polar column, isothermal

Data compiled by: NIST Mass Spectrometry Data Center, William E. Wallace, director

Column type PackedPackedPackedPacked
Active phase OV-1OV-1OV-1OV-1
Column length (m)   4.4.
Carrier gas NitrogenNitrogenNitrogenNitrogen
Substrate Gas-Chrom QGas-Chrom QGas-Chrom Q (60-80 mesh)Gas-Chrom Q (60-80 mesh)
Column diameter (mm)
Phase thickness (μm)
Temperature (C) 230.250.230.250.
I 2680.2690.2680.2690.
ReferenceNicoud, Balavoine, et al., 1972Nicoud, Balavoine, et al., 1972Nicoud, Moradpour, et al., 1972Nicoud, Moradpour, et al., 1972
Comment MSDC-RI MSDC-RI MSDC-RI MSDC-RI

References

Nicoud, Balavoine, et al., 1972
Nicoud, J.F.; Balavoine, G.; Kagan, H.; Martin, R.H.; Deblecker, M., Chromatographie en phase vapeur d'helicenes et de diaryl-1,2-ethylenes, J. Chromatogr., 1972, 66, 1, 43-53, https://doi.org/10.1016/S0021-9673(01)82926-5 . [all data]

Nicoud, Moradpour, et al., 1972
Nicoud, J.F.; Moradpour, A.; Balavoine, G.; Kagan, H.; Martin, R.H.; Deblecker, M., Chromatographie en phase vapeur d'helicenes et de diaryl-1,2 ethylenes, J. Chromatogr., 1972, 66, 1, 43-53, https://doi.org/10.1016/S0021-9673(01)82926-5 . [all data]