Tricyclo[8.4.0.0(2,7)]dodecane, isomer # 2

Normal alkane RI, polar column, isothermal

Data compiled by: NIST Mass Spectrometry Data Center, William E. Wallace, director

Column type CapillaryCapillary
Active phase Carbowax 20MCarbowax 20M
Column length (m) 50.50.
Carrier gas N2N2
Substrate
Column diameter (mm) 0.250.25
Phase thickness (μm)
Temperature (C) 125.150.
I 1705.1747.
ReferenceVanek, Podrouzková, et al., 1970Vanek, Podrouzková, et al., 1970
Comment MSDC-RI MSDC-RI

References

Vanek, Podrouzková, et al., 1970
Vanek, J.; Podrouzková, B.; Landa, S., Gas chromatographic behaviour of tricyclic saturated hydrocarbons. The relation between the retention indices and the stereochemical structure of the tricyclanes, J. Chromatogr., 1970, 52, 77-86, https://doi.org/10.1016/S0021-9673(01)96546-X . [all data]