Tricyclo[8.3.0.0(4,9)]dodecane, isomer # 5

Normal alkane RI, non-polar column, isothermal

View large format table.

Column type Active phase Temperature (C) I Reference Comment
CapillarySE-30150.1461.Vanek, Podrouzková, et al., 1970N2; Column length: 50. m; Column diameter: 0.25 mm
CapillarySE-30175.1486.Vanek, Podrouzková, et al., 1970N2; Column length: 50. m; Column diameter: 0.25 mm

Normal alkane RI, polar column, isothermal

View large format table.

Column type Active phase Temperature (C) I Reference Comment
CapillaryCarbowax 20M125.1767.Vanek, Podrouzková, et al., 1970N2; Column length: 50. m; Column diameter: 0.25 mm
CapillaryCarbowax 20M150.1718.Vanek, Podrouzková, et al., 1970N2; Column length: 50. m; Column diameter: 0.25 mm

References

Vanek, Podrouzková, et al., 1970
Vanek, J.; Podrouzková, B.; Landa, S., Gas chromatographic behaviour of tricyclic saturated hydrocarbons. The relation between the retention indices and the stereochemical structure of the tricyclanes, J. Chromatogr., 1970, 52, 77-86, https://doi.org/10.1016/S0021-9673(01)96546-X . [all data]