Tricyclo[7.2.1.0(5,12)]dodecane, isomer # 4

Normal alkane RI, non-polar column, isothermal

View large format table.

Column type Active phase Temperature (C) I Reference Comment
CapillarySE-30150.1323.Vanek, Podrouzková, et al., 1970N2; Column length: 50. m; Column diameter: 0.25 mm
CapillarySE-30175.1344.Vanek, Podrouzková, et al., 1970N2; Column length: 50. m; Column diameter: 0.25 mm

Normal alkane RI, polar column, isothermal

View large format table.

Column type Active phase Temperature (C) I Reference Comment
CapillaryCarbowax 20M125.1504.Vanek, Podrouzková, et al., 1970N2; Column length: 50. m; Column diameter: 0.25 mm
CapillaryCarbowax 20M150.1539.Vanek, Podrouzková, et al., 1970N2; Column length: 50. m; Column diameter: 0.25 mm

References

Vanek, Podrouzková, et al., 1970
Vanek, J.; Podrouzková, B.; Landa, S., Gas chromatographic behaviour of tricyclic saturated hydrocarbons. The relation between the retention indices and the stereochemical structure of the tricyclanes, J. Chromatogr., 1970, 52, 77-86, https://doi.org/10.1016/S0021-9673(01)96546-X . [all data]