2,3-Dimethylbutan-1-thiol

Normal alkane RI, non-polar column, isothermal

View large format table.

Column type Active phase Temperature (C) I Reference Comment
CapillaryDC-20050.859.Leppin, Gollnick, et al., 1969Argon; Column length: 100. m

References

Leppin, Gollnick, et al., 1969
Leppin, E.; Gollnick, K.; Schomburg, G., Gas chromatographic identification of isomeric mercaptans, Chromatographia, 1969, 2, 12, 535-540, https://doi.org/10.1007/BF02260096 . [all data]