(E) -3-hydroxy-5,9-dimethyldeca-4,8-dien-2-on (R,S)

Normal alkane RI, non-polar column, temperature ramp

Data compiled by: NIST Mass Spectrometry Data Center, William E. Wallace, director

Column type Capillary
Active phase Optima-5MS
Column length (m) 30.
Carrier gas H2
Substrate
Column diameter (mm) 0.25
Phase thickness (μm) 0.25
Tstart (C) 40.
Tend (C) 230.
Heat rate (K/min) 4.
Initial hold (min)
Final hold (min)
I 1455.
ReferenceZorn, Schüler, et al., 2003
Comment MSDC-RI

References

Zorn, Schüler, et al., 2003
Zorn, H.; Schüler, M.; Berger, R.G., Pyruvate decarboxylase catalysed formation of terpenoid α-hydroxy ketones, Biocatal. Biotransform., 2003, 21, 6, 341-347, https://doi.org/10.1080/10242420310001630173 . [all data]