(1S ,1'R )-1-(6,6-dimethyl-bicyclo[3.1.1]hept-2-en- 2-yl)-1-hydroxy-2-propanone (S)

Normal alkane RI, polar column, temperature ramp

Data compiled by: NIST Mass Spectrometry Data Center, William E. Wallace, director

Column type Capillary
Active phase DB-Wax
Column length (m) 30.
Carrier gas He
Substrate
Column diameter (mm) 0.32
Phase thickness (μm) 0.25
Tstart (C) 40.
Tend (C) 230.
Heat rate (K/min) 3.
Initial hold (min) 3.
Final hold (min)
I 2036.
ReferenceZorn, Schüler, et al., 2003
Comment MSDC-RI

References

Zorn, Schüler, et al., 2003
Zorn, H.; Schüler, M.; Berger, R.G., Pyruvate decarboxylase catalysed formation of terpenoid α-hydroxy ketones, Biocatal. Biotransform., 2003, 21, 6, 341-347, https://doi.org/10.1080/10242420310001630173 . [all data]