Methyloctenone

Normal alkane RI, non-polar column, custom temperature program

View large format table.

Column type Active phase I Reference Comment
CapillaryNonpolar976.Staples and Zeiger, 2008Program: not specified

References

Staples and Zeiger, 2008
Staples, E.; Zeiger, K., On-Site Measurements of VOCs and Odors from Metal Casting Operations Using an Ultra-Fast Gas Chromatograph, 2008, retrieved from http://www.estcal.com/TechPapers/Industrial/FoundryOdors.doc. [all data]