(E)-1-(2',4',5'-Trimethoxyphenyl)butadiene

Van Den Dool and Kratz RI, non-polar column, temperature ramp

Data compiled by: NIST Mass Spectrometry Data Center, William E. Wallace, director

Column type Capillary
Active phase DB-5
Column length (m) 30.
Carrier gas He
Substrate
Column diameter (mm) 0.25
Phase thickness (μm) 0.25
Tstart (C) 60.
Tend (C) 260.
Heat rate (K/min) 5.
Initial hold (min)
Final hold (min)
I 1708.
ReferenceSabulal, Dan, et al., 2007
Comment MSDC-RI

References

Sabulal, Dan, et al., 2007
Sabulal, B.; Dan, M.; John, A.; Kurup, R.; Chandrika, S.P.; George, V., Phenylbutanoid-rich rhizome oil of Zingiber neesanum from Western Ghats, southern India, Flavour Fragr. J., 2007, 22, 6, 521-524, https://doi.org/10.1002/ffj.1834 . [all data]