2-Hexenyl butanoate, isomer # 2

Van Den Dool and Kratz RI, polar column, temperature ramp

Data compiled by: NIST Mass Spectrometry Data Center, William E. Wallace, director

Column type Capillary
Active phase HP-20M
Column length (m) 50.
Carrier gas Helium
Substrate
Column diameter (mm) 0.20
Phase thickness (μm) 0.20
Tstart (C) 70.
Tend (C) 180.
Heat rate (K/min) 4.
Initial hold (min) 4.
Final hold (min) 15.
I 2067.
ReferencePoliteo, Jukic, et al., 2007
Comment MSDC-RI

References

Politeo, Jukic, et al., 2007
Politeo, O.; Jukic, M.; Milos, M., Chemical Composition and Antioxidant Activity of Free Volatile Aglycones from Laurel (Laurus nobilis L.) Compared to Its Essential Oil, Croatica Chem. Acta, 2007, 80, 1, 121-126. [all data]