(E)-1-Nitropentadec-1-ene

Normal alkane RI, non-polar column, custom temperature program

View large format table.

Column type Active phase I Reference Comment
CapillaryZB-52019.Piskorski R., Hanus R., et al., 200730. m/0.25 mm/0.25 μm; Program: 60C => 3C/min => 240C 20C/min => 320C

References

Piskorski R., Hanus R., et al., 2007
Piskorski R.; Hanus R.; Vasickova S.; Cvacka J.; Sobotnik J.; Svatos A.; Valterova I., Nitroalkenes and sesquiterpene hydrocarbons from the frontal gland of three Prorhinotermes termite species, J. Chem. Ecol., 2007, 33, 9, 1787-1794, https://doi.org/10.1007/s10886-007-9341-y . [all data]