α-Kaurene

Van Den Dool and Kratz RI, non-polar column, temperature ramp

View large format table.

Column type Active phase I Reference Comment
CapillaryRTX-12046.Paolini, Muselli, et al., 200760. m/0.22 mm/0.25 μm, He, 2. K/min, 230. C @ 35. min; Tstart: 60. C

Van Den Dool and Kratz RI, polar column, temperature ramp

View large format table.

Column type Active phase I Reference Comment
CapillaryRTX-Wax2363.Paolini, Muselli, et al., 200760. m/0.22 mm/0.25 μm, He, 2. K/min, 230. C @ 35. min; Tstart: 60. C

References

Paolini, Muselli, et al., 2007
Paolini, J.; Muselli, A.; Bernardini, A.-F.; Bighelli, A.; Casanova, J.; Costa, J., Thymol derivatives from essential oil of Doronicum corsicum L., Flavour Fragr. J., 2007, 22, 6, 479-487, https://doi.org/10.1002/ffj.1824 . [all data]