1,2,4-Methenoazulene, decahydro-1,5,5,8a-tetramethyl-, [1S-(1a`,2a`,3aa',4a`,8aa',9R*)]-

Van Den Dool and Kratz RI, non-polar column, temperature ramp

Data compiled by: NIST Mass Spectrometry Data Center, William E. Wallace, director

Column type CapillaryCapillary
Active phase DB-PetroDB-Petro
Column length (m) 50.50.
Carrier gas
Substrate
Column diameter (mm) 0.20.2
Phase thickness (μm) 0.50.5
Tstart (C) 50.50.
Tend (C) 270.270.
Heat rate (K/min) 2.2.
Initial hold (min)
Final hold (min)
I 1376.21376.2
ReferencePang T., Zhu S., et al., 2007Pang T., Zhu S., et al., 2007
Comment MSDC-RI MSDC-RI

References

Pang T., Zhu S., et al., 2007
Pang T.; Zhu S.; Lu X.; Xu G., Identification of unknown compounds on the basis of retention index data in comprehensive two-dimensional gas chromatography, J. Sep. Sci., 2007, 30, 6, 868-874, https://doi.org/10.1002/jssc.200600471 . [all data]