(E,Z)-Farnesyl laurate

Van Den Dool and Kratz RI, polar column, temperature ramp

Data compiled by: NIST Mass Spectrometry Data Center, William E. Wallace, director

Column type Capillary
Active phase ZB-FFAP
Column length (m) 30.
Carrier gas He
Substrate
Column diameter (mm) 0.25
Phase thickness (μm) 0.25
Tstart (C) 100.
Tend (C) 250.
Heat rate (K/min) 2.5
Initial hold (min)
Final hold (min)
I 3054.
ReferenceLee, Finckbeiner, et al., 2007
Comment MSDC-RI

References

Lee, Finckbeiner, et al., 2007
Lee, H.; Finckbeiner, S.; Yu, J.S.; Wiemer, D.F.; Eisner, T.; Attygalle, A.B., Characterization of (E,E)-farnesol and its fatty acid esters from anal scent glands of nutria (Myocastor coypus) by gas chromatography-mass spectrometry and gas chromatography-infrared spectrometry, J. Chromatogr. A, 2007, 1165, 1-2, 136-143, https://doi.org/10.1016/j.chroma.2007.06.041 . [all data]