E5,E7-dodecadien-1-ol

Normal alkane RI, non-polar column, temperature ramp

Data compiled by: NIST Mass Spectrometry Data Center, William E. Wallace, director

Column type Capillary
Active phase DB-5
Column length (m) 30.
Carrier gas Nitrogen
Substrate
Column diameter (mm) 0.25
Phase thickness (μm) 0.25
Tstart (C) 80.
Tend (C) 220.
Heat rate (K/min) 8.
Initial hold (min) 1.
Final hold (min) 10.
I 1537.
ReferenceKong, Zhang, et al., 2007
Comment MSDC-RI

References

Kong, Zhang, et al., 2007
Kong, X.B.; Zhang, Z.; Zhao, C.H.; Wang, H.B., Female sex pheromone of the Yunnan pine caterpillar moth Dendrolimus Houi: first (E,Z)-isomer in pheromone components of Dendrolimus spp, J. Chem. Ecol., 2007, 33, 7, 1316-1327, https://doi.org/10.1007/s10886-007-9313-2 . [all data]