Glycerol, 1-caproate-3-arachidate-, 2-OTMS-

Normal alkane RI, non-polar column, custom temperature program

View large format table.

Column type Active phase I Reference Comment
CapillaryHP-53355.Isidorov, Rusak, et al., 2007He; Column length: 30. m; Column diameter: 0.25 mm; Program: not specified

References

Isidorov, Rusak, et al., 2007
Isidorov, V.A.; Rusak, M.; Szczepaniak, L.; Witkowski, S., Gas chromatographic retention indices of trimethylsilyl derivatives of mono- and diglycerides on capillary columns with non-polar stationary phases, J. Chromatogr. A, 2007, 1166, 1-2, 207-211, https://doi.org/10.1016/j.chroma.2007.07.047 . [all data]