(R)-γ-dodecalactone

Normal alkane RI, non-polar column, custom temperature program

Data compiled by: NIST Mass Spectrometry Data Center, William E. Wallace, director

Column type Capillary
Active phase DB-5
Column length (m) 30.
Carrier gas He
Substrate
Column diameter (mm) 0.25
Phase thickness (μm) 0.25
Program 40C(1min) => 7C/min => 110C => 5C/min => 180C => 10C/min => 240C(10min)
I 1680.
ReferenceGreger and Schieberle, 2007
Comment MSDC-RI

References

Greger and Schieberle, 2007
Greger, V.; Schieberle, P., Characterization of the Key Aroma Compounds in Apricots (Prunus armeniaca) by Application of the Molecular Sensory Science Concept, J. Agric. Food Chem., 2007, 55, 13, 5221-5228, https://doi.org/10.1021/jf0705015 . [all data]