(R)-γ-decalactone

Normal alkane RI, non-polar column, custom temperature program

View large format table.

Column type Active phase I Reference Comment
CapillaryDB-51471.Greger and Schieberle, 200730. m/0.25 mm/0.25 μm, He; Program: 40C(1min) => 7C/min => 110C => 5C/min => 180C => 10C/min => 240C(10min)

Normal alkane RI, polar column, custom temperature program

View large format table.

Column type Active phase I Reference Comment
CapillaryDB-FFAP2140.Greger and Schieberle, 200730. m/0.32 mm/0.25 μm, He; Program: 40C(1min) => 7C/min => 180C => 10C/min => 240C (10min)

References

Greger and Schieberle, 2007
Greger, V.; Schieberle, P., Characterization of the Key Aroma Compounds in Apricots (Prunus armeniaca) by Application of the Molecular Sensory Science Concept, J. Agric. Food Chem., 2007, 55, 13, 5221-5228, https://doi.org/10.1021/jf0705015 . [all data]