3'-acetylindicine

Normal alkane RI, non-polar column, custom temperature program

View large format table.

Column type Active phase I Reference Comment
CapillaryDB-12195.Frolich, Ober, et al., 2007Column length: 30. m; Column diameter: 0.32 mm; Program: not specified

References

Frolich, Ober, et al., 2007
Frolich, C.; Ober, D.; Hartmann, T., Tissue distribution, core biosynthesis and diversification of pyrrolizidine alkaloids of the lycopsamine type in three Boraginaceae species, Phytochemistry, 2007, 68, 7, 1026-1037, https://doi.org/10.1016/j.phytochem.2007.01.002 . [all data]