2-epi-Prezizanoic acid

Normal alkane RI, non-polar column, temperature ramp

View large format table.

Column type Active phase I Reference Comment
CapillaryHP-5MS1884.Champagnat, Bessière, et al., 200725. m/0.25 mm/0.25 μm, He, 50. C @ 5. min, 5. K/min; Tend: 300. C

References

Champagnat, Bessière, et al., 2007
Champagnat, P.; Bessière, J.-M.; Chezal, J.-M.; Chalchat André-Paul Carnat4*, J.-C., New compounds from the essential oil of Vetiveria nigritana roots from Mali, Flavour Fragr. J., 2007, 22, 6, 488-493, https://doi.org/10.1002/ffj.1828 . [all data]