7-(2,4-Hexadiynylidene)-1,6-dioxaspiro[4,4]nona-2,8-diene

Normal alkane RI, non-polar column, temperature ramp

Data compiled by: NIST Mass Spectrometry Data Center, William E. Wallace, director

Column type Capillary
Active phase HP-5MS
Column length (m) 30.
Carrier gas He
Substrate
Column diameter (mm) 0.25
Phase thickness (μm) 0.25
Tstart (C) 60.
Tend (C) 280.
Heat rate (K/min) 3.
Initial hold (min)
Final hold (min)
I 1802.
ReferenceBasta, Pavlovic, et al., 2007
Comment MSDC-RI

References

Basta, Pavlovic, et al., 2007
Basta, A.; Pavlovic, M.; Couladis, M.; Tzakou, O., Essential oil composition of the flowerheads of Chrysanthemum coronarium L. from Greece, Flavour Fragr. J., 2007, 22, 3, 197-200, https://doi.org/10.1002/ffj.1781 . [all data]