2-(2,4-Hexadiynylidene)-1,6-dioxaspiro[4,4]non-3-ene

Normal alkane RI, non-polar column, temperature ramp

View large format table.

Column type Active phase I Reference Comment
CapillaryHP-5MS1875.Basta, Pavlovic, et al., 200730. m/0.25 mm/0.25 μm, He, 3. K/min; Tstart: 60. C; Tend: 280. C

References

Basta, Pavlovic, et al., 2007
Basta, A.; Pavlovic, M.; Couladis, M.; Tzakou, O., Essential oil composition of the flowerheads of Chrysanthemum coronarium L. from Greece, Flavour Fragr. J., 2007, 22, 3, 197-200, https://doi.org/10.1002/ffj.1781 . [all data]