(+)-(1R,6S,7S,10S)-7β-Hydroxyamorpha-4,11-diene

Van Den Dool and Kratz RI, non-polar column, custom temperature program

View large format table.

Column type Active phase I Reference Comment
CapillaryCP Sil 5 CB1614.Adio, von Reuß, et al., 2007Program: not specified

Normal alkane RI, non-polar column, temperature ramp

View large format table.

Column type Active phase I Reference Comment
CapillaryCP Sil 5 CB1614.Adio, 2005H2, 3. K/min; Column length: 25. m; Tstart: 50. C; Tend: 230. C

References

Adio, von Reuß, et al., 2007
Adio, A.M.; von Reuß, S.H.; Paul, C.; Muhle, H.; Konig, W.A., Sesquiterpenoid constituents of the liverwort Marsupella aquatica, Tetrahedron: Asymmetry, 2007, 18, 10, 1245-1253, https://doi.org/10.1016/j.tetasy.2007.05.020 . [all data]

Adio, 2005
Adio, A.M., Isolation and structure elucidation of sesquiterpenoids from the essential oils of some liverworths (Hepaticae), Dissertation, Hamburg University, 2005, 265. [all data]