3-Hydroxytetradecanedioic acid, tri-TMS

Van Den Dool and Kratz RI, non-polar column, temperature ramp

View large format table.

Column type Active phase I Reference Comment
CapillarySE-522461.Lefevere, Verhaeghe, et al., 198925. m/0.32 mm/0.52 μm, He, 5. K/min; Tstart: 70. C; Tend: 270. C

Normal alkane RI, non-polar column, temperature ramp

View large format table.

Column type Active phase I Reference Comment
CapillarySE-522461.Verhaeghe, van Bocxlaer, et al., 199225. m/0.32 mm/0.12 μm, He, 5. K/min; Tstart: 70. C; Tend: 270. C

References

Lefevere, Verhaeghe, et al., 1989
Lefevere, M.F.; Verhaeghe, B.J.; Declerck, D.H.; Van Bocxlaer, J.F.; De Leenheer, A.P.; De Sagher, R.M., Metabolic Profiling of Urinary Organic Acids by Single and Multicolumn Capillary Gas Chromatography, J. Chromatogr. Sci., 1989, 27, 1, 23-29, https://doi.org/10.1093/chromsci/27.1.23 . [all data]

Verhaeghe, van Bocxlaer, et al., 1992
Verhaeghe, B.J.; van Bocxlaer, J.F.; de Leenheer, A.P., Gas chromatographic/mass spectrometric identification of 3-hydroxydicarboxylic acids in urine, Biol. Mass Spectrom., 1992, 21, 1, 27-32, https://doi.org/10.1002/bms.1200210107 . [all data]