Norbornane, 6-chloro-2-trichloromethyl, exo-Cl

Normal alkane RI, non-polar column, temperature ramp

View large format table.

Column type Active phase I Reference Comment
CapillaryOV-1011482.Zenkevich, Eliseenkov, et al., 2006Nitrogen, 6. K/min, 240. C @ 10. min; Column length: 25. m; Column diameter: 0.20 mm; Tstart: 60. C

References

Zenkevich, Eliseenkov, et al., 2006
Zenkevich, I.G.; Eliseenkov, E.V.; Kasatochkin, A.N., Application of Retention Indices in GC-MS Identification of Halogenated Organic Compounds, Mass Spectromery (Rus.), 2006, 3, 2, 131-140. [all data]