Norbornane, 2-bromo-3-(trichloromethyl), exo-Br

Normal alkane RI, non-polar column, temperature ramp

Data compiled by: NIST Mass Spectrometry Data Center, William E. Wallace, director

Column type Capillary
Active phase OV-101
Column length (m) 25.
Carrier gas Nitrogen
Substrate
Column diameter (mm) 0.20
Phase thickness (μm)
Tstart (C) 60.
Tend (C) 240.
Heat rate (K/min) 6.
Initial hold (min)
Final hold (min) 10.
I 1540.
ReferenceZenkevich, Eliseenkov, et al., 2006
Comment MSDC-RI

References

Zenkevich, Eliseenkov, et al., 2006
Zenkevich, I.G.; Eliseenkov, E.V.; Kasatochkin, A.N., Application of Retention Indices in GC-MS Identification of Halogenated Organic Compounds, Mass Spectromery (Rus.), 2006, 3, 2, 131-140. [all data]