2,4-dimethyl-diamantane

Kovats' RI, non-polar column, temperature ramp

View large format table.

Column type Active phase I Reference Comment
CapillaryHP-5MS1572.Yang, Wang, et al., 200630. m/0.25 mm/0.25 μm, 50. C @ 2. min, 6. K/min; Tend: 300. C

References

Yang, Wang, et al., 2006
Yang, C.; Wang, Z.D.; Hollebone, B.P.; Peng, X.; Fingas, M.; Landriault, M., GC/MS Quantitation of diamondoid compounds in crude oils and petroleum products, Environmental Forensics, 2006, 7, 4, 377-390, https://doi.org/10.1080/15275920600996396 . [all data]