2-Methyl-3-ketoisobutyric acid, enol, TMS

Van Den Dool and Kratz RI, non-polar column, temperature ramp

Data compiled by: NIST Mass Spectrometry Data Center, William E. Wallace, director

Column type CapillaryCapillaryCapillary
Active phase OV-1SE-52SE-52
Column length (m) 10.25.25.
Carrier gas HeHeHe
Substrate
Column diameter (mm) 0.220.320.32
Phase thickness (μm) 0.170.520.52
Tstart (C) 70.70.70.
Tend (C) 270.270.270.
Heat rate (K/min) 5.5.5.
Initial hold (min)
Final hold (min)
I 1328.1278.1327.
ReferenceLefevere, Verhaeghe, et al., 1989Lefevere, Verhaeghe, et al., 1989Lefevere, Verhaeghe, et al., 1989
Comment MSDC-RI MSDC-RI MSDC-RI

References

Lefevere, Verhaeghe, et al., 1989
Lefevere, M.F.; Verhaeghe, B.J.; Declerck, D.H.; Van Bocxlaer, J.F.; De Leenheer, A.P.; De Sagher, R.M., Metabolic Profiling of Urinary Organic Acids by Single and Multicolumn Capillary Gas Chromatography, J. Chromatogr. Sci., 1989, 27, 1, 23-29, https://doi.org/10.1093/chromsci/27.1.23 . [all data]