(Z)-2-Heptenyl acetate

Normal alkane RI, non-polar column, temperature ramp

View large format table.

Column type Active phase I Reference Comment
CapillaryDB-11080.Khalighi-Sigaroodi, Hadijiakhoondi, et al., 200530. m/0.25 mm/0.25 μm, He, 50. C @ 1. min, 2.5 K/min, 265. C @ 30. min

References

Khalighi-Sigaroodi, Hadijiakhoondi, et al., 2005
Khalighi-Sigaroodi, F.; Hadijiakhoondi, A.; Shahverdi, A.R.; Mozaffarian, V.-A.; Shafiee, A., Chemical composition and antimicrobial activity of the essential oil of Ferulago Bernardii Tomk. and M.Pimen., DARU, 2005, 13, 3, 100-104. [all data]