5-methyl-5-hepten-2-one

Normal alkane RI, non-polar column, temperature ramp

View large format table.

Column type Active phase I Reference Comment
CapillaryBPX-51012.Kalua, Allen, et al., 200530. m/0.25 mm/0.25 μm, 40. C @ 8. min, 5. K/min, 200. C @ 10. min

References

Kalua, Allen, et al., 2005
Kalua, C.M.; Allen, M.S.; Bedgood, D.R., Jr.; Bishop, A.G.; Prenzler, P.D., Discrimination of Olive Oils and Fruits into Cultivars and Maturity Stages Based on Phenolic and Volatile Compounds, J. Agric. Food Chem., 2005, 53, 20, 8054-8062, https://doi.org/10.1021/jf051233i . [all data]