Propanamide, 2-methyl-N-propyl

Kovats' RI, non-polar column, isothermal

Data compiled by: NIST Mass Spectrometry Data Center, William E. Wallace, director

Column type Packed
Active phase SE-30
Column length (m) 1.
Carrier gas N2
Substrate Chromosorb W AW
Column diameter (mm)
Phase thickness (μm)
Temperature (C) 180.
I 1090.
ReferenceKrawczyk and Piotrowski, 1989
Comment MSDC-RI

References

Krawczyk and Piotrowski, 1989
Krawczyk, W.; Piotrowski, G.T., Relationships Between Structure and Retention Index for N-Substituted Amides of Aliphatic Acids on a Non-Polar Column, J. Chromatogr., 1989, 463, 297-304, https://doi.org/10.1016/S0021-9673(01)84484-8 . [all data]