diacrylate of tri-propoxylated glycerol (Acrylic acid 2-{2-acryloyloxy-3-[2-(2-hydroxy-propoxy)-propoxy]-propoxy}-1-methyl-ethyl ester)

Van Den Dool and Kratz RI, non-polar column, temperature ramp

View large format table.

Column type Active phase I Reference Comment
CapillaryMDN-52222.Yoo, Pace, et al., 200430. m/0.32 mm/0.25 μm, He, 50. C @ 3. min, 10. K/min, 320. C @ 10. min

References

Yoo, Pace, et al., 2004
Yoo, S.J.; Pace, G.V.; Khoo, B.K.; Lech, J.; Hartman, T.G., Mass Spectrometry and Gas Chromatographic Retention Indices of Selected UV/EB-Curable Monomers and Photoinitiators Commonly Used in Food Packaging Print and Coating Formulations, Radtech Report, Radtech Report; Technical Paper, 2004, 8. [all data]