α-Farnesene isomer

Van Den Dool and Kratz RI, non-polar column, temperature ramp

Data compiled by: NIST Mass Spectrometry Data Center, William E. Wallace, director

Column type CapillaryCapillary
Active phase SBP-5SBP-5
Column length (m) 60.60.
Carrier gas HeliumHelium
Substrate
Column diameter (mm) 0.250.25
Phase thickness (μm) 0.250.25
Tstart (C) 50.50.
Tend (C) 240.240.
Heat rate (K/min) 5.5.
Initial hold (min) 3.3.
Final hold (min) 10.10.
I 1511.1520.
ReferenceYoo, Kim, et al., 2004Yoo, Kim, et al., 2004
Comment MSDC-RI MSDC-RI

References

Yoo, Kim, et al., 2004
Yoo, Z.-W.; Kim, N.-S.; Lee, D.-S., Comparative analyses of the flavors from Hallabong (Citrus sphaerocarpa) with lemon, orange, and grapefruit by SPTE and HS-SPME combined with GC-MS, Bull. Korean Chem. Soc., 2004, 25, 2, 271-279, https://doi.org/10.5012/bkcs.2004.25.2.271 . [all data]