2,6,10,14-Tetramethyl-9-(3-methyl-pent-4-enylidene)-trans-pentadeca-2,6-diene

Normal alkane RI, non-polar column, temperature ramp

View large format table.

Column type Active phase I Reference Comment
CapillaryHP-12121.Massé, Belt, et al., 2004He, 5. K/min, 300. C @ 10. min; Tstart: 40. C
CapillaryHP-52130.Massé, Belt, et al., 2004He, 5. K/min, 300. C @ 10. min; Tstart: 40. C

References

Massé, Belt, et al., 2004
Massé, G.; Belt, S.T.; Allard, W.G.; Lewis, C.A.; Wakeham, S.G.; Rowland, S.J., Occurrence of novel monocyclic alkenes from diatoms in marine particulate matter and sediments, Org. Geochem., 2004, 35, 7, 813-822, https://doi.org/10.1016/j.orggeochem.2004.03.004 . [all data]