2,6(E),10(Z)-Nonadecatriene, 2,6,10,14,18-pentamethyl-13-(3-methyl-4-pentenylidene)

Normal alkane RI, non-polar column, temperature ramp

View large format table.

Column type Active phase I Reference Comment
CapillaryHP-12505.Massé, Belt, et al., 2004He, 5. K/min, 300. C @ 10. min; Tstart: 40. C
CapillaryHP-52519.Massé, Belt, et al., 2004He, 5. K/min, 300. C @ 10. min; Tstart: 40. C

Normal alkane RI, non-polar column, custom temperature program

View large format table.

Column type Active phase I Reference Comment
CapillaryHP-52516.Ogihara and Ashi, 2004Program: not specified

References

Massé, Belt, et al., 2004
Massé, G.; Belt, S.T.; Allard, W.G.; Lewis, C.A.; Wakeham, S.G.; Rowland, S.J., Occurrence of novel monocyclic alkenes from diatoms in marine particulate matter and sediments, Org. Geochem., 2004, 35, 7, 813-822, https://doi.org/10.1016/j.orggeochem.2004.03.004 . [all data]

Ogihara and Ashi, 2004
Ogihara, S.; Ashi, J., Lipids composition in deep sea sediment covered by a bacterial mat collected from the Ryuyo Canyon, off Tokai, JAMSTEC J. Deep Sea Res., 2004, 24, 25-36. [all data]