9,13,17,21-Tetramethylheptatriacontane

Normal alkane RI, non-polar column, temperature ramp

View large format table.

Column type Active phase I Reference Comment
CapillaryDB-13813.Katritzky, Chen, et al., 200030. m/0.32 mm/0.25 μm; Tstart: 60. C; Tend: 320. C

Normal alkane RI, non-polar column, custom temperature program

View large format table.

Column type Active phase I Reference Comment
CapillaryPolydimethyl siloxane3813.Junkes, Castanho, et al., 2003Program: not specified

References

Katritzky, Chen, et al., 2000
Katritzky, A.R.; Chen, K.; Maran, U.; Carlson, D.A., QSPR Correlation and predictions of GC retention indexes for methyl-branched hydrocarbons produced by insects, Anal. Chem., 2000, 72, 1, 101-109, https://doi.org/10.1021/ac990800w . [all data]

Junkes, Castanho, et al., 2003
Junkes, B.S.; Castanho, R.D.M.; Amboni, C.; Yunes, R.A.; Heinzen, V.E.F., Semiempirical Topological Index: A Novel Molecular Descriptor for Quantitative Structure-Retention Relationship Studies, Internet Electronic Journal of Molecular Design, 2003, 2, 1, 33-49. [all data]