(E)-1-(3,4-dimethoxyphenyl)but-1-ene

Van Den Dool and Kratz RI, non-polar column, temperature ramp

Data compiled by: NIST Mass Spectrometry Data Center, William E. Wallace, director

Column type CapillaryCapillary
Active phase DB-5DB-5
Column length (m) 30.30.
Carrier gas HeN2
Substrate
Column diameter (mm) 0.250.25
Phase thickness (μm) 0.250.25
Tstart (C) 60.75.
Tend (C) 260.230.
Heat rate (K/min) 5.3.
Initial hold (min)  10.
Final hold (min)
I 1612.1616.
ReferenceSabulal, Dan, et al., 2007bin Jantan, Yassin, et al., 2003
Comment MSDC-RI MSDC-RI

References

Sabulal, Dan, et al., 2007
Sabulal, B.; Dan, M.; John, A.; Kurup, R.; Chandrika, S.P.; George, V., Phenylbutanoid-rich rhizome oil of Zingiber neesanum from Western Ghats, southern India, Flavour Fragr. J., 2007, 22, 6, 521-524, https://doi.org/10.1002/ffj.1834 . [all data]

bin Jantan, Yassin, et al., 2003
bin Jantan, I.; Yassin, M.S.M.; Chin, C.B.; Chen, L.L.; Sim. N.L., Antifungal activity of the essential oils of nine Zingiberaceae species, Pharm. Biol., 2003, 41, 5, 392-397, https://doi.org/10.1076/phbi.41.5.392.15941 . [all data]