7-epi-Helifolane (syn)

Normal alkane RI, polar column, custom temperature program

Data compiled by: NIST Mass Spectrometry Data Center, William E. Wallace, director

Column type Capillary
Active phase DB-Wax
Column length (m)
Carrier gas
Substrate
Column diameter (mm)
Phase thickness (μm)
Program not specified
I 1606.
ReferenceWeyerstahl P., Marschall H., et al., 2001
Comment MSDC-RI

Normal alkane RI, non-polar column, temperature ramp

Data compiled by: NIST Mass Spectrometry Data Center, William E. Wallace, director

Column type Capillary
Active phase CP Sil 5 CB
Column length (m) 25.
Carrier gas N2
Substrate
Column diameter (mm) 0.25
Phase thickness (μm) 0.39
Tstart (C) 60.
Tend (C) 220.
Heat rate (K/min) 5.
Initial hold (min)
Final hold (min)
I 1430.
ReferenceWeyerstahl P., Marschall H., et al., 2001
Comment MSDC-RI

References

Weyerstahl P., Marschall H., et al., 2001
Weyerstahl P.; Marschall H.; Christiansen C., Constituents of the acidic part of commercial Brazilian lantana oil, Flavour Fragr. J., 2001, 16, 1, 50-60, https://doi.org/10.1002/1099-1026(200101/02)16:1<50::AID-FFJ945>3.0.CO;2-1 . [all data]