7-epi-Helifolan-12-ol (syn)

Normal alkane RI, non-polar column, temperature ramp

View large format table.

Column type Active phase I Reference Comment
CapillaryCP Sil 5 CB1697.Weyerstahl P., Marschall H., et al., 200125. m/0.25 mm/0.39 μm, N2, 5. K/min; Tstart: 60. C; Tend: 220. C

Normal alkane RI, polar column, custom temperature program

View large format table.

Column type Active phase I Reference Comment
CapillaryDB-Wax2446.Weyerstahl P., Marschall H., et al., 2001Program: not specified

References

Weyerstahl P., Marschall H., et al., 2001
Weyerstahl P.; Marschall H.; Christiansen C., Constituents of the acidic part of commercial Brazilian lantana oil, Flavour Fragr. J., 2001, 16, 1, 50-60, https://doi.org/10.1002/1099-1026(200101/02)16:1<50::AID-FFJ945>3.0.CO;2-1 . [all data]