O18-2-hydroxy-1,4-benzoxazin-3-one, O-trimethylsilyl

Kovats' RI, non-polar column, temperature ramp

Data compiled by: NIST Mass Spectrometry Data Center, William E. Wallace, director

Column type Capillary
Active phase DB-5
Column length (m) 30.
Carrier gas He
Substrate
Column diameter (mm) 0.25
Phase thickness (μm) 0.25
Tstart (C) 50.
Tend (C) 300.
Heat rate (K/min) 10.
Initial hold (min) 2.
Final hold (min) 10.
I 1741.
ReferenceSpiteller, Glawischnig, et al., 2001
Comment MSDC-RI

References

Spiteller, Glawischnig, et al., 2001
Spiteller, P.; Glawischnig, E.; Gierl, A.; Steglich, W., Studies on the biosynthesis of 2-hydroxy-1,4-benzoxazin-3-one (HBOA) from 3-hydroxyindolin-2-one in Zea mays, Phytochemistry, 2001, 57, 3, 373-376, https://doi.org/10.1016/S0031-9422(01)00037-1 . [all data]